New Jersey Superior Court - Passaic County
type: Class
subclass of: R1A5cd40F21ccBABafb0C2e8
definition: The New Jersey Superior Court - Passaic County is a trial court within the New Jersey court system that has jurisdiction over civil and criminal cases in Passaic County.