Specific Performance
type: Class
alternative label: 具体履行
subclass of: R8jYAnNATrfoBxAtIKpf72X
subclass of: R9iUJ1YX0zK3V9D0RbQKTP4
definition: A legal remedy where a court orders a party to fulfill their contractual obligations as specified in the agreement, rather than awarding monetary damages.