B180 Avoidance Action Analysis
type: Class
subclass of: RnHqWL9K7RvKt0cOTLMx3pw
definition: Review of potential avoiding actions under Sections 544-549 of the Code to determine whether adversary proceedings are warranted