Financial Stability Oversight Council
type: Class
alternative label: 金融稳定监督委员会
subclass of: RAA299e70Ea01E3Ba1dBAe8f
hidden label: FSOC
definition: The Financial Stability Oversight Council (FSOC) is a United States federal government organization, established by Title I of the Dodd'Frank Wall Street Reform and Consumer Protection Act. The Council is charged with identifying risks to the financial stability of the United States; promoting market discipline; and responding to emerging risks to the stability of the United States' financial system.