River Nile
type: Class
alternative label: SD+NR
subclass of: R7D2a4a5B3d44C416dfF6ba8
hidden label: SD+NR
definition: The River Nile is a body of water that flows through Sudan, providing a vital source of water for the region.