Nakapiripirit
type: Class
alternative label: UG+311
subclass of: R8680cbB69cf63001936Bffe
hidden label: UG+311
definition: Nakapiripirit is a location in Uganda, specifically a district within the country.