Bureau of Ocean Energy Management
type: Class
alternative label: 海洋能源管理局
subclass of: R5BD36eE92713E8Ce71D3a0d
hidden label: BOEM
definition: The Bureau of Ocean Energy Management (BOEM) is an agency within the United States Department of the Interior, established in 2010 by Secretarial Order.