Eastern
type: Class
alternative label: Sierra Leone
alternative label: SL+E
subclass of: R9933d8D0A4fbF3CacdDB995
hidden label: SL+E
definition: Eastern (Sierra Leone) refers to the eastern region of Sierra Leone, which is a political subdivision within the country.