Federal Transit Administration
type: Class
alternative label: 联邦交通管理局
subclass of: RC2Ddc09177c7B1338a16e36
hidden label: FTA
definition: The Federal Transit Administration (FTA) is an agency within the United States Department of Transportation (DOT) that provides financial and technical assistance to local public transportation systems.