Nyamira
type: Class
alternative label: KE+34
subclass of: R888ccd914a7eAC7d68FC0db
hidden label: KE+34
definition: Nyamira is a location in Kenya, specifically a political subdivision within the country.