Tennessee State Courts
type: Class
alternative label: TN
subclass of: R1F4dbe4CD17b3B2a7f15b97
hidden label: TN
definition: Tennessee State Courts are the judicial system of the state of Tennessee, consisting of various courts such as the Tennessee Circuit Court, Tennessee Court of Criminal Appeals, Tennessee Court of Appeals, Tennessee Superior Court for Law and Equity, and Tennessee Supreme Court.