Dysgraphia
type: Class
preferred label: Writing Impairment
alternative label: Writing Disorder
subclass of: RCHYAaMF4QRHH9QwmNKGN8Y
definition: Dysgraphia is a specific learning disability that affects an individual's ability to write coherently, leading to difficulties with spelling, handwriting, and organizing thoughts on paper. This condition can result from impaired fine motor skills, difficulties with language processing, or both.