M&A E Financing Practice
type: Class
alternative label: M&A E融资实践
subclass of: RVLgJukt9MTZNfTewtxNIK
definition: M&A E Financing Practice refers to the legal practice area that deals with mergers and acquisitions as well as financing transactions related to those deals.