Florida County Court - Sumter County
type: Class
subclass of: R71ioUDFC2H7Ndh54CU1rlM
definition: A court located in Sumter County, Florida that has jurisdiction over certain legal matters within its geographic area.