Possession of Drug Paraphernalia
type: Class
alternative label: 拥有毒品工具
subclass of: RCqBiJAwLT5iG2nvk12tNKW
definition: The possession of drug paraphernalia refers to the act of having equipment, materials, or products that are intended for use in the consumption, preparation, or storage of illegal drugs, and is classified as a criminal misdemeanor offense.