Presumption of Undue Hardship
type: Class
alternative label: 不当困难推定
subclass of: RXSQ7cfAYqk20qAg9n2wxi
definition: A legal assumption that a debtor cannot repay their debts without experiencing significant hardship, which may be used as a defense in bankruptcy proceedings.