U.S. District Courts
type: Class
alternative label: DISCOUS
subclass of: RO1j8FWXas50yVNMQcEmtu
hidden label: DISCOUS
definition: U.S. District Courts are a subset of the U.S. Federal Courts and are responsible for hearing and deciding cases within their respective geographic regions.