National Capital Region
type: Class
alternative label: PH+00
subclass of: R286f5eC097e5DCE808BD672
hidden label: PH+00
definition: The National Capital Region is the designated administrative region in the Philippines where the country's capital city, Manila, is located.