Dolnoslaskie
type: Class
alternative label: PL+DS
subclass of: R428238242a27F1454d5C7c6
hidden label: PL+DS
definition: Dolnoslaskie refers to a region in Poland, located in the southwestern part of the country.