U.S. Nuclear Regulatory Commission
type: Class
preferred label: NRC
alternative label: 美国核能监管委员会
subclass of: R22815eC3Af3bFF0d002Ca58
hidden label: NRC
definition: The Nuclear Regulatory Commission (NRC) is an independent agency of the United States government tasked with protecting public health and safety related to nuclear energy.