EPA Office of the Inspector General
type: Class
alternative label: EPA审计长办公室
subclass of: R8B143aF7620361Fd34F3911
hidden label: EPAOIG
definition: Office of the Inspector General (EPAOIG) is part of the Environmental protection Agency (EPA).