Office of Disability Employment Policy
type: Class
alternative label: 残疾雇佣政策办公室
subclass of: R15Bf89EBBcdd05Ca4462a0b
hidden label: ODEP
definition: The Office of Disability Employment Policy (ODEP) is the only non-regulatory federal agency that promotes policies and coordinates with employers and all levels of government to increase workplace success for people with disabilities.