Office of Solid Waste and Emergency Response
type: Class
alternative label: 固体废物和应急响应办公室
subclass of: R8B143aF7620361Fd34F3911
hidden label: OSWER
definition: Office of Solid Waste and Emergency Response (OSWER) is part of the Environmental protection Agency (EPA).