Saki
type: Class
alternative label: AZ+SA
subclass of: R4FC82b4EBc13AC28949829f
hidden label: AZ+SA
definition: Saki is a location in Azerbaijan, which is a country in the South Caucasus region of Eurasia.