Abkhazia
type: Class
alternative label: GE+AB
subclass of: RB62c1302E565752670C3401
hidden label: GE+AB
definition: Abkhazia is a region located in Georgia, with its own government and political status that is disputed by Georgia and other countries.