Delta
type: Class
alternative label: NG+DE
subclass of: R4B9dec71E2dd97181f99777
hidden label: NG+DE
definition: A delta is a landform that forms at the mouth of a river, where the river flows into an ocean, sea, estuary, lake, or reservoir, and deposits sediment that it has carried from upstream.