Voreio Aigaio
type: Class
alternative label: GR+K
subclass of: R5CB856E87466FF97b1146c3
hidden label: GR+K
definition: Voreio Aigaio is a region in Greece, located in the northern part of the Aegean Sea.