A121 Review and Analysis
type: Class
subclass of: RnTEPb LCSNqAkQqrfte8zg
definition: For discovery and eDiscovery, the inspection, review, consideration and analysis of documents and/or evidence. Includes coding and relevance issues. Excludes creation of privilege log (A124 ).