Period of Duration Clause
type: Class
alternative label: 期限条款
subclass of: RDe0RKU39BlhcyACJW30ZLc
definition: A period of duration clause is a provision in a contract that specifies the length of time that the agreement will remain in effect.