Court Costs
type: Class
alternative label: 法院费用
subclass of: R9rEOlPrMiUpUlQrMe18m1X
definition: Court Costs: Expenses incurred in the course of a legal proceeding that are typically paid by the losing party, including fees for court clerks, marshals, and reporters.