Consensual Lien
type: Class
alternative label: 协议留置权
subclass of: R7OGr396bNkl4sseQ1bBCA6
definition: A consensual lien is a type of lien that is created by agreement between the parties involved, allowing the lienholder to have a security interest in the property of the debtor until the debt is paid off.