Turkish, Ottoman
type: Class
alternative label: 土耳其奥斯曼语
subclass of: RDOvAHsvY8TKJ1O1orXPM9o
definition: Turkish, Ottoman (1500-1928) is a language used during the Ottoman Empire period in Turkey and surrounding regions.