invoice segment
type: Class
subclass of: RC3hDYvR4ffxmqJg2F8YGT6
definition: "Information on the Invoices submitted by the Firm for the Client. There will be 1 or more INVOICE segments per CLIENT segment. "