Additional Matching Rights Period
type: Class
alternative label: 额外匹配权利期间
subclass of: RGwortSox0oBPyp9H9dcEw
definition: A period of time granted to a party in a legal matter, allowing them the opportunity to match the terms of a proposed transaction before it is finalized, in addition to the previously established matching rights period.