Norwegian Nynorsk; Nynorsk, Norwegian
type: Class
alternative label: 挪威尼诺斯克语; 尼诺斯克语，挪威语
subclass of: RDOvAHsvY8TKJ1O1orXPM9o
definition: Norwegian Nynorsk is a written or spoken structured system of communication that consists of grammar and vocabulary, and is a variation of the Norwegian language.