Hearing
type: Class
alternative label: 听证会
subclass of: R73Uo5x4VyfiOXt6i4R256t
definition: A hearing is a legal event within the context of litigation, where parties present arguments and evidence to a judge or other decision-maker.