L602 Interviews
type: Class
subclass of: RioWfXa6EStqdylbbgrK0lA
definition: Activities and actions related to the conducting of interviews with custodians, data stewards, or other individuals or groups within the organization.