A119 Culling & Filtering
type: Class
subclass of: RnTEPb LCSNqAkQqrfte8zg
definition: For discovery and eDiscovery, activities associated with grouping and filtering documents for processing. Includes deduplication, deNIST*, etc. Excludes culling and filtering associated with the creation of a Privilege Log (A124).