Litigation Hold Event
type: Class
alternative label: 诉讼保留事件
subclass of: R73Uo5x4VyfiOXt6i4R256t
definition: A Litigation Hold Event is a specific event within the context of a legal dispute where a party is required to preserve relevant evidence.