Official Aramaic ; Imperial Aramaic
type: Class
alternative label: 官方阿拉姆语; 帝国阿拉姆语
subclass of: RDOvAHsvY8TKJ1O1orXPM9o
definition: Official Aramaic and Imperial Aramaic are ancient languages used between 700-300 BCE in official and imperial contexts.