Disorderly House
type: Class
alternative label: 淫乱之家
subclass of: RLvhxz3b1k2IU3MaAgeRtF
definition: A Disorderly House is a type of crime against the public that involves maintaining a dwelling or establishment where illegal activities, such as prostitution or gambling, take place.