N'Ko
type: Class
subclass of: RDOvAHsvY8TKJ1O1orXPM9o
definition: A writing system used to write the Mande languages of West Africa, characterized by a distinctive script with geometric shapes and lines.