Accrued Rights Clause
type: Class
alternative label: 应计权利条款
subclass of: RDe0RKU39BlhcyACJW30ZLc
definition: An Accrued Rights Clause is a provision in a contract that ensures the preservation of rights that have already been acquired by the parties involved, even if the contract is terminated or modified.