License (Agreement)
type: Class
alternative label: 许可证
subclass of: R88D8i8AcSTUig2X3yPbFHg
subclass of: RBAoFbSK8WP6xJyVrgQd5PZ
subclass of: RCzs34uEQI9f4cuWp3bQO0P
definition: A License (Agreement) is a legal document that grants permission to use a particular product or service under certain terms and conditions.