Judicial Legal Conclusion
type: Class
alternative label: 司法法律结论
subclass of: RNICD9MDcFQJJX6nxX11Vt
definition: An asserted legal argument, proposition, or point of law, as adopted by a decisionmaker (e.g., judge, magistrate, arbitrator).