Negligent Interference with Contractual Relationship
type: Class
alternative label: 过失干涉合同关系
subclass of: RBqyMMilyJsOelem8C8QQRu
subclass of: RCfunX4u69LUQ3gbhckE0oI
definition: Negligent Interference with Contractual Relationship is a legal claim that arises when a third party's careless actions cause a breach of contract between two parties.