Employee Layoff Event
type: Class
preferred label: Layoff
alternative label: Redundancy
subclass of: R7qfDUdV0uQYPGsrjTf3QDf
definition: Employee layoff event refers to the temporary or permanent separation of employees from their jobs due to economic conditions, organizational restructuring, or other non-performance-related factors. Unlike terminations for misconduct or performance issues, layoffs are generally not the fault of the employee.