Disclosure Schedules
type: Class
alternative label: 披露计划
subclass of: R9pDifEQPZakjZCBdUYZVOW
definition: Disclosure Schedules are documents that provide detailed information about a company's assets, liabilities, contracts, and other important information that is relevant to a merger or acquisition transaction.