Deemed Contribution and Distribution Clause
type: Class
alternative label: 被视为出资和分配条款
subclass of: RDe0RKU39BlhcyACJW30ZLc
definition: A Deemed Contribution and Distribution Clause is a provision in a contract that specifies how contributions and distributions will be treated as if they were made on a certain date, regardless of when they were actually made.