Makasar
type: Class
alternative label: 望加锡
subclass of: RDOvAHsvY8TKJ1O1orXPM9o
definition: Makasar is a language that belongs to the Austronesian language family and is primarily spoken in the South Sulawesi province of Indonesia.